BDBM50142328 4-{1-Benzotriazol-1-yl-1-[4-(difluoro-phosphono-methyl)-benzyl]-2-[4-(difluoro-phosphono-methyl)-phenyl]-ethyl}-benzoic acid methyl ester::CHEMBL268903
SMILES COC(=O)c1ccc(cc1)C(Cc1ccc(cc1)C(F)(F)P(O)(O)=O)(Cc1ccc(cc1)C(F)(F)P(O)(O)=O)n1nnc2ccccc12
InChI Key InChIKey=CLRSCKINFSDJJY-UHFFFAOYSA-N
Data  4 IC50
  Tab Delimited (TSV)   2D SDfile   Computed 3D by Vconf -m prep SDfile
Find this compound or compounds like it in BindingDB:
Activity Spreadsheet -- Enzyme Inhibition Constant Data from BindingDB
Found 2 hits for monomerid = 50142328
TargetTyrosine-protein phosphatase non-receptor type 1(Homo sapiens (Human))
Merck Frosst Centre For Therapeutic Research
Curated by ChEMBL
LigandPNGBDBM50142328(4-{1-Benzotriazol-1-yl-1-[4-(difluoro-phosphono-me...)
Affinity DataIC50:  11nM. Assay description: Inhibitory activity against Protein tyrosine phosphatase 1B (PTP1B) overexpressed in intact Sf9 cell assay
In DepthDetails ArticlePubMed
TargetTyrosine-protein phosphatase non-receptor type 1(Homo sapiens (Human))
Merck Frosst Centre For Therapeutic Research
Curated by ChEMBL
LigandPNGBDBM50142328(4-{1-Benzotriazol-1-yl-1-[4-(difluoro-phosphono-me...)
Affinity DataIC50:  84nM. Assay description: Inhibitory activity against Protein tyrosine phosphatase 1B (PTP1B) overexpressed in intact Sf9 cell assay
In DepthDetails ArticlePubMed